{"text_format":"1","workbook":"xlsx","n_sheets":3,"sheets":["Instruktionen","Modulplan","Listen"],"not_rendered":{"charts":0,"images":0,"macros":1,"external_links":0,"defined_names":0,"comments":0,"pivot_tables":0},"unopened":[],"bounds":{"document_bytes":16777216,"sheet_cells":100000,"rows_first":2000,"rows_last":500,"rows_between":2000,"halvings":0,"cell_chars":16384,"cell_head_chars":4096},"cells_cut":0,"cells_raw":0,"read":"whole","date_system":"1900"}

{"sheet":"Instruktionen","index":0,"n_rows":44,"n_cols":3,"rows_kept":44,"cut":false,"hidden":false,"merged":[]}
[]
[null,"CheckIt!"]
[]
[null,"Das Überprüfungsprogramm für deinen Modulplan."]
[]
[]
[]
[null,1,"Unten, am Rande dieses Tabellenblattes siehst du 2 Registerkarten (\"Instruktionen\" und \"Modulplan\"). Um zwischen den \"Blättern\" hin und her zu wechseln, einfach klicken."]
[]
[null,2,"Das allererste, was zu tun ist: Vorname und Nachname in die vorgegebenen Felder tippen (Zelle O3 und O4) sowie deine Klasse auswählen. (Per Dropdown-Liste - wenn du mit der Maus das Feld O5 anklickst, klicke auf den kleinen Pfeil, der auftaucht. Die Auswahlliste zeigt dir alle Möglichkeiten, die dir zur Verfügung stehen. Eine derartige Liste wird noch öfter auf diesem Modulplan auftauchen.)"]
[]
[null,3,"Starte deine Fächerwahl mit den Kernmodulen: Wähle zunächst ETH, RE oder RK in den Zellen B4-L4, danach E (7.Kl.), E (8.Kl.) oder E durchgehend im Feld A7 (funktioniert wie bei Schritt 2 immer per Dropdown-Liste). Die Stundenanzahl der gewählten Module wird automatisch angepasst (Solltest du in Englisch mündlich maturieren wollen, musst du sowohl in der 7. als auch in der 8. Klasse ein Englisch Basis- oder Wahlmodul besuchen)."]
[]
[null,4,"Wähle deine Sprache im Feld A13. Je nachdem, ob du dir eine 20- oder 24-Stunden-Sprache aussuchst, verändert sich der Maximalwert für den Ergänzungsbereich (um 4 Std.)."]
[]
[null,5,"Jetzt kannst du alle restlichen Basismodule eintragen, wobei du die Dropdown-Listen jeweils in den einzelnen Zellen (z.B. B15 für Physik im WS1) findest. Die Stundenanzahl wird automatisch errechnet. Manche Stunden laufen parallel und sind somit nicht gleichzeitig wählbar. Du erhältst eine Nachricht, wenn das der Fall sein sollte."]
[]
[null,6,"Den Ergänzungsbereich füllst du bitte manuell aus, bei den Stunden hast du die Auswahl zwischen 2, 3 oder 4 Stunden. Bei Wahlmodulen im Basisbereich (INF, BE, ME) gilt ein ähnliches Prozedere, außer, dass die Stundenanzahl automatisch erscheint, sobald du ein Wahlmodul eingibst."]
[]
[null,7,"Beachte die farbigen Felder: Orange bedeutet, dass dieses Modul am Plan schon vorhanden ist - eine unerlaubte Doppelbuchung also. In gelbe Felder (leer) muss unbedingt noch eine Stunde / ein Modulname ergänzt werden - hier fehlt etwas. Rote Stundensummen bedeuten, dass die aktuelle Zusammensetzung nicht möglich ist - überarbeite den Plan nochmals."]
[]
[null,8,"Bitte beachte, dass dieses CheckIt-Programm nicht alle Regeln des Modulsystems überprüft. Bestimmtes (z.B. Kursnummern der Wahlmodule) unterliegt deiner Verantwortung. Solltest du Fragen zum Modulplan haben, wende dich bitte an Prof. Windischhofer!"]
[]
[null,9,"Sobald alle Farbwarnungen beseitigt sind, ist dein Modulplan bereit für die CheckIt!-Prüfung. Klicke dazu auf den Button \"CheckIt!\" rechts von der Tabelle. Sollte alles ordnungsgemäß ausgefüllt sein, erhält dein Modulplan das grüne CheckIt-Gütesiegel und das Feld A1 färbt sich grün."]
[]
[null,10,"Solltest du jetzt noch etwas verändern, wird sich das CheckIt-Gütesiegel und das Feld A1 wieder rot färben - dann kannst du es nochmals checken lassen. Mit grünem Gütesiegel und ausgefülltem Modulplan klicke auf das Feld \"Get me to Windisch\" und dein fertiger Modulplan wird als PDF-Datei unter dem Titel VornameNachnameKlasse (z.B. MaxMustermann7C) im selben Ordner wie dieses Excel-Dokument abgespeichert. "]
[]
[]
[]
[null,"Richtwerte (Std.)"]
[]
[null,80,"Kernmodule"]
[null,"20/24","Sprache"]
[null,28,"Naturwissenschaften (+1)"]
[null,16,"Geisteswissenschaften (+1)"]
[null,12,"Kunst (+1)"]
[null,"48/44","Ergänzungsbereich je nach gewählter Sprache (mind.)"]
[null,204,"Gesamtsumme (mind.)"]
[null,36,"Maximalstundenanzahl pro Semester (+1)"]
[]
[]
[]
[]
[null,"Designed & Created By Simon Nehrer & Felix Oblin 2014"]

{"sheet":"Modulplan","index":1,"n_rows":44,"n_cols":19,"rows_kept":44,"cut":false,"hidden":false,"merged":[[6,13,7,14],[29,0,29,12],[35,0,35,12],[0,11,0,12],[2,0,2,12],[11,0,11,12],[13,0,13,12],[23,0,23,12],[0,0,1,0],[0,1,0,2],[0,3,0,4],[0,5,0,6],[0,7,0,8],[0,9,0,10]]}
[{"$f":"IF(OR(O5=\"5C\",O5=\"5D\"),\"5. Klasse SKP\",IF(OR(O5=\"6C\",O5=\"6D\"),\"6. Klasse SKP\",\"7. Klasse SKP\"))","v":"5. Klasse SKP"},{"$f":"IF(A1=\"5. Klasse SKP\",\"WS 15/16\",IF(A1=\"6. Klasse SKP\",\"WS 14/15\",\"WS 13/14\"))","v":"WS 15/16"},null,{"$f":"IF(B1=\"WS 15/16\",\"SS 15/16\",IF(B1=\"WS 14/15\",\"SS 14/15\",\"SS 13/14\"))","v":"SS 15/16"},null,{"$f":"IF(D1=\"SS 15/16\",\"WS 16/17\",IF(D1=\"SS 14/15\",\"WS 15/16\",\"WS 14/15\"))","v":"WS 16/17"},null,{"$f":"IF(F1=\"WS 16/17\",\"SS 16/17\",IF(F1=\"WS 15/16\",\"SS 15/16\",\"SS 14/15\"))","v":"SS 16/17"},null,{"$f":"IF(H1=\"SS 16/17\",\"WS 17/18\",IF(H1=\"SS 15/16\",\"WS 16/17\",\"WS 15/16\"))","v":"WS 17/18"},null,{"$f":"IF(J1=\"WS 17/18\",\"SS 17/18\",IF(J1=\"WS 16/17\",\"SS 16/17\",\"SS 15/16\"))","v":"SS 17/18"},null,null,null,null,null,null,{"$f":"IF(A19=A25,\"\",\"1\")","v":""}]
[null,"Modul","Std.","Modul","Std.","Modul","Std.","Modul","Std.","Modul","Std.","Modul","Std."]
["Kermodule",null,null,null,null,null,null,null,null,null,null,null,null,"Vorname:"]
["ETH/RK/RE","ETH",2,"ETH",2,"ETH",2,"ETH",2,"ETH",2,"ETH",2,"Name:"]
["D","D",3,"D",3,"D",3,"D",3,"D",3,"D",3,"Klasse:","5C"]
["M","M",3,"M",3,"M",3,"M",3,"M",3,"M",3]
["E 7.Kl","Ea",3,"Ea",3,{"$f":"IF(OR($A$7=\"E 7.Kl\",A7=\"E durchgehend\"),\"Eb\",\"\")","v":"Eb"},{"$f":"IF(F7<>\"\",3,\"\")","v":3},{"$f":"IF(OR($A$7=\"E 7.Kl\",A7=\"E durchgehend\"),\"Eb\",\"\")","v":"Eb"},{"$f":"IF(H7<>\"\",3,\"\")","v":3},{"$f":"IF(OR($A$7=\"E 8.Kl\",A7=\"E durchgehend\"),\"Ec\",\"\")","v":""},{"$f":"IF(J7<>\"\",3,\"\")","v":""},{"$f":"IF(OR($A$7=\"E 8.Kl\",A7=\"E durchgehend\"),\"Ec\",\"\")","v":""},{"$f":"IF(L7<>\"\",3,\"\")","v":""},"CheckIt-Gütesiegel"]
["BSP","BSP",2,"BSP",2,"BSP",2,"BSP",2,"BSP",2,"BSP",2]
["KOSO","KOSO",2,"KOSO",2]
["PP",{"$f":"IF(A1<>\"5. Klasse SKP\", \"PP\",\"\")","v":""},{"$f":"IF(B10<>\"\",2,\"\")","v":""},{"$f":"IF(A1<>\"5. Klasse SKP\", \"PP\",\"\")","v":""},{"$f":"IF(D10<>\"\",2,\"\")","v":""},{"$f":"IF(A1=\"5. Klasse SKP\", \"PP\",\"\")","v":"PP"},{"$f":"IF(F10<>\"\",2,\"\")","v":2},{"$f":"IF(A1=\"5. Klasse SKP\", \"PP\",\"\")","v":"PP"},{"$f":"IF(H10<>\"\",2,\"\")","v":2}]
["Summe/Sem.",null,{"$f":"SUM(C4:C10)","v":15},null,{"$f":"SUM(E4:E10)","v":15},null,{"$f":"SUM(G4:G10)","v":15},null,{"$f":"SUM(I4:I10)","v":15},null,{"$f":"SUM(K4:K10)","v":10},null,{"$f":"SUM(M4:M10)","v":10},{"$f":"IF(A7=\"E durchgehend\",SUM(C11,E11,G11,I11,K11,M11)-6,SUM(C11,E11,G11,I11,K11,M11))","v":80},"(=80 )"]
["durchgängig gewählte Sprache"]
[null,{"$f":"IF(A13=\"\",\"\",A13)","v":""},{"$f":"IF(OR(B13=\"RU\",B13=\"IT\"),4,IF(B13<>\"\",3,0))","v":0},{"$f":"IF(A13=\"\",\"\",A13)","v":""},{"$f":"IF(OR(D13=\"RU\",D13=\"IT\"),4,IF(D13<>\"\",3,0))","v":0},{"$f":"IF(A13=\"\",\"\",A13)","v":""},{"$f":"IF(F13<>\"\",4,0)","v":0},{"$f":"IF(A13=\"\",\"\",A13)","v":""},{"$f":"IF(H13<>\"\",4,0)","v":0},{"$f":"IF(A13=\"\",\"\",A13)","v":""},{"$f":"IF(OR(J13=\"RU\",J13=\"IT\"),4,IF(J13<>\"\",3,0))","v":0},{"$f":"IF(A13=\"\",\"\",A13)","v":""},{"$f":"IF(OR(L13=\"RU\",L13=\"IT\"),4,IF(L13<>\"\",3,0))","v":0},{"$f":"SUM(C13+E13+G13+I13+K13+M13)","v":0},"(=20 / 24)"]
["Naturwissenschaftliche Fächer"]
["Physik",null,{"$f":"IF(B15<>\"\",3,\"\")","v":""},null,{"$f":"IF(D15<>\"\",3,\"\")","v":""},null,{"$f":"IF(F15<>\"\",3,\"\")","v":""},null,{"$f":"IF(H15<>\"\",3,\"\")","v":""},null,{"$f":"IF(J15<>\"\",3,\"\")","v":""},null,{"$f":"IF(L15<>\"\",3,\"\")","v":""}]
["BU",null,{"$f":"IF(B16<>\"\",3,\"\")","v":""},null,{"$f":"IF(D16<>\"\",3,\"\")","v":""},null,{"$f":"IF(F16<>\"\",3,\"\")","v":""},null,{"$f":"IF(H16<>\"\",3,\"\")","v":""},null,{"$f":"IF(J16<>\"\",3,\"\")","v":""},null,{"$f":"IF(L16<>\"\",3,\"\")","v":""}]
["Chemie",null,{"$f":"IF(B17<>\"\",3,\"\")","v":""},null,{"$f":"IF(D17<>\"\",3,\"\")","v":""},null,{"$f":"IF(F17<>\"\",3,\"\")","v":""},null,{"$f":"IF(H17<>\"\",3,\"\")","v":""},null,{"$f":"IF(J17<>\"\",3,\"\")","v":""},null,{"$f":"IF(L17<>\"\",3,\"\")","v":""}]
["NAWI",null,{"$f":"IF(B18<>\"\",4,\"\")","v":""},null,{"$f":"IF(D18<>\"\",4,\"\")","v":""}]
["GW",null,{"$f":"IF(B19<>\"\",2,\"\")","v":""},null,{"$f":"IF(D19<>\"\",2,\"\")","v":""},null,{"$f":"IF(F19<>\"\",IF(OR(F19=\"GWa\",F19=\"GWEa\"),2,3),\"\")","v":""},null,{"$f":"IF(H19<>\"\",IF(OR(H19=\"GWa\",H19=\"GWEa\"),2,3),\"\")","v":""},null,{"$f":"IF(J19<>\"\",3,\"\")","v":""},null,{"$f":"IF(L19<>\"\",3,\"\")","v":""}]
["Darst. Geometrie",null,null,null,null,null,{"$f":"IF(F20<>\"\",2,\"\")","v":""},null,{"$f":"IF(H20<>\"\",2,\"\")","v":""},null,{"$f":"IF(J20<>\"\",2,\"\")","v":""},null,{"$f":"IF(L20<>\"\",2,\"\")","v":""}]
["Informatik",null,{"$f":"IF(B21<>\"\",2,\"\")","v":""},null,{"$f":"IF(D21<>\"\",2,\"\")","v":""},null,{"$f":"IF(F21<>\"\",2,\"\")","v":""},null,{"$f":"IF(H21<>\"\",2,\"\")","v":""},null,null,null,null,{"$f":"IF(A1=\"5. Klasse SKP\",SUM(C22,E22,G22,I22,K22,M22),IF(A1=\"6. Klasse SKP\",SUM(C21,C22,E22,E21,G22,I22,K22,M22),SUM(C21,C22,E22,E21,G21,G22,I22,I21,K21,K22,M22,M21)))","v":0},{"$f":"IF(N21>8,1,0)","v":0}]
["IN Wahlmodule",null,{"$f":"IF(B22<>\"\",2,\"\")","v":""},null,{"$f":"IF(D22<>\"\",2,\"\")","v":""},null,{"$f":"IF(F22<>\"\",2,\"\")","v":""},null,{"$f":"IF(H22<>\"\",2,\"\")","v":""},null,{"$f":"IF(J22<>\"\",2,\"\")","v":""},null,{"$f":"IF(L22<>\"\",2,\"\")","v":""},{"$f":"SUM(C22,E22,G22,I22,K22,M22)","v":0}]
["Summe/Sem.",null,{"$f":"IF(A1=\"5. Klasse SKP\", SUM(C15,C16,C17,C18,C19,C22),SUM(C15:C22))","v":0},null,{"$f":"IF(A1=\"5. Klasse SKP\", SUM(E15:E19,E22),SUM(E15:E22))","v":0},null,{"$f":"IF(A1<>\"7. Klasse SKP\", SUM(G15:G17,G19:G20,G22),SUM(G15:G22))","v":0},null,{"$f":"IF(C1<>\"7. Klasse SKP\", SUM(I15:I17,I19:I20,I22),SUM(I15:I22))","v":0},null,{"$f":"SUM(K15:K22)","v":0},null,{"$f":"SUM(M15:M22)","v":0},{"$f":"SUM(C23+E23+G23+I23+K23+M23)","v":0},"(=28)"]
["Geisteswissenschaftliche Fächer"]
["GW",null,{"$f":"IF(B25<>\"\",2,\"\")","v":""},null,{"$f":"IF(D25<>\"\",2,\"\")","v":""},null,{"$f":"IF(F25<>\"\",IF(OR(F25=\"GWa\",F25=\"GWEa\"),2,3),\"\")","v":""},null,{"$f":"IF(H25<>\"\",IF(OR(H25=\"GWa\",H25=\"GWEa\"),2,3),\"\")","v":""},null,{"$f":"IF(J25<>\"\",3,\"\")","v":""},null,{"$f":"IF(L25<>\"\",3,\"\")","v":""}]
["Geschichte",null,{"$f":"IF(B26<>\"\",2,\"\")","v":""},null,{"$f":"IF(D26<>\"\",2,\"\")","v":""},null,{"$f":"IF(F26=\"GSa\",2,IF(F26=\"GSb\",3,\"\"))","v":""},null,{"$f":"IF(H26=\"GSa\",2,IF(H26=\"GSb\",3,\"\"))","v":""},null,{"$f":"IF(J26<>\"\",3,\"\")","v":""},null,{"$f":"IF(L26<>\"\",3,\"\")","v":""}]
["KOSO",null,null,null,null,null,{"$f":"IF(F27<>\"\",2,\"\")","v":""},null,{"$f":"IF(H27<>\"\",2,\"\")","v":""},null,{"$f":"IF(J27<>\"\",2,\"\")","v":""},null,{"$f":"IF(L27<>\"\",2,\"\")","v":""}]
["PP",null,null,null,null,null,{"$f":"IF(F28=\"PP\",2,\"\")","v":""},null,{"$f":"IF(H28=\"PP\",2,\"\")","v":""},null,{"$f":"IF(J28<>\"\",2,\"\")","v":""},null,{"$f":"IF(L28<>\"\",2,\"\")","v":""}]
["Summe/Sem.",null,{"$f":"SUM(C25:C26)","v":0},null,{"$f":"SUM(E25:E26)","v":0},null,{"$f":"SUM(G25:G28)","v":0},null,{"$f":"SUM(I25:I28)","v":0},null,{"$f":"SUM(K25:K28)","v":0},null,{"$f":"SUM(M25:M28)","v":0},{"$f":"SUM(C29+E29+G29+I29+K29+M29)","v":0},"(=16)"]
["Künstlerische Fächer"]
["BE",null,{"$f":"IF(B31<>\"\",2,\"\")","v":""},null,{"$f":"IF(D31<>\"\",2,\"\")","v":""},null,{"$f":"IF(F31<>\"\",2,\"\")","v":""},null,{"$f":"IF(H31<>\"\",2,\"\")","v":""},null,{"$f":"IF(J31<>\"\",2,\"\")","v":""},null,{"$f":"IF(L31<>\"\",2,\"\")","v":""},{"$f":"SUM(C31,C33,E31,E33,G31,G33,I31,I33,K31,K33,M31,M33)","v":0}]
["Musik",null,{"$f":"IF(B32<>\"\",2,\"\")","v":""},null,"",null,"",null,"",null,"",null,"",{"$f":"SUM(C32,C34,E32,E34,G34,G32,I32,I34,K34,K32,M32,M34)","v":0}]
["BE Wahlmodule",null,"",null,"",null,"",null,"",null,"",null,""]
["ME Wahlmodule",null,"",null,"",null,"",null,"",null,"",null,""]
["Summe/Sem.",null,{"$f":"SUM(C31:C34)","v":0},null,{"$f":"SUM(E31:E34)","v":0},null,{"$f":"SUM(G31:G34)","v":0},null,{"$f":"SUM(I31:I34)","v":0},null,{"$f":"SUM(K31:K34)","v":0},null,{"$f":"SUM(M31:M34)","v":0},{"$f":"SUM(C35+E35+G35+I35+K35+M35)","v":0},"(=12)"]
["Ergänzungsbereich"]
[]
[]
[]
[]
[]
[]
[null,null,{"$f":"SUM(C37:C42)","v":0},null,{"$f":"SUM(E37:E42)","v":0},null,{"$f":"SUM(G37:G42)","v":0},null,{"$f":"SUM(I37:I42)","v":0},null,{"$f":"SUM(K37:K42)","v":0},null,{"$f":"SUM(M37:M42)","v":0},{"$f":"IF(A7=\"E durchgehend\",SUM(C43,E43,G43,I43,K43,M43,K7,M7),SUM(C43,E43,G43,I43,K43,M43))","v":0},"(=48 / 44)"]
["Total/Sem.",null,{"$f":"SUM(C11,C13,C23,C29,C35,C43)","v":15},null,{"$f":"SUM(E11,E13,E23,E29,E35,E43)","v":15},null,{"$f":"SUM(G11,G13,G23,G29,G35,G43)","v":15},null,{"$f":"SUM(I11,I13,I23,I29,I35,I43)","v":15},null,{"$f":"SUM(K11,K13,K23,K29,K35,K43)","v":10},null,{"$f":"SUM(M11,M13,M23,M29,M35,M43)","v":10},{"$f":"SUM(C44,E44,G44,I44,K44,M44)","v":80},"Gesamtsumme aller Module:  204"]

{"sheet":"Listen","index":2,"n_rows":69,"n_cols":8,"rows_kept":69,"cut":false,"hidden":false,"merged":[]}
["Stundenwert",null,"NAWI"]
[2]
[3,null,"Physik"]
[4]
[null,null,{"$f":"IF(OR(Modulplan!B16=\"BUa\",Modulplan!B16=\"BUEa\"),\"Parallel mit BU(E) - für PH zuerst abwählen!\",\"PHa\")","v":"PHa"},{"$f":"IF(OR(Modulplan!D16=\"BUa\",Modulplan!D16=\"BUEa\"),\"Parallel mit BU(E) - für PH zuerst abwählen!\",\"PHa\")","v":"PHa"},{"$f":"IF(OR(Modulplan!F16=\"BUa\",Modulplan!F16=\"BUEa\"),\"Parallel mit BU(E) - für PH zuerst abwählen!\",\"PHa\")","v":"PHa"},{"$f":"IF(OR(Modulplan!H16=\"BUa\",Modulplan!H16=\"BUEa\"),\"Parallel mit BU(E) - für PH zuerst abwählen!\",\"PHa\")","v":"PHa"},{"$f":"IF(OR(Modulplan!J16=\"BUb\",Modulplan!J16=\"BUEb\"),\"Parallel mit BU(E) - für PH zuerst abwählen!\",\"PHb\")","v":"PHb"},{"$f":"IF(OR(Modulplan!L16=\"BUb\",Modulplan!L16=\"BUEb\"),\"Parallel mit BU(E) - für PH zuerst abwählen!\",\"PHb\")","v":"PHb"}]
[null,null,null,null,{"$f":"IF(OR(Modulplan!F16=\"BUb\",Modulplan!F16=\"BUEb\"),\"Parallel mit BU(E) - für PH zuerst abwählen!\",\"PHb\")","v":"PHb"},{"$f":"IF(OR(Modulplan!H16=\"BUb\",Modulplan!H16=\"BUEb\"),\"Parallel mit BU(E) - für PH zuerst abwählen!\",\"PHb\")","v":"PHb"}]
[]
["Ethik",null,"Biologie"]
["RK"]
["RE",null,{"$f":"IF(Modulplan!$B$15<>\"\",\"Parallel mit PH - für BU zuerst abwählen!\",IF(Modulplan!A16=\"BU\",\"BUa\",\"BUEa\"))","v":"BUa"},{"$f":"IF(Modulplan!$D$15<>\"\",\"Parallel mit PH - für BU zuerst abwählen!\",IF(Modulplan!A16=\"BU\",\"BUa\",\"BUEa\"))","v":"BUa"},{"$f":"IF(Modulplan!$F$15=\"PHa\",\"Parallel mit PH - für BU zuerst abwählen!\",IF(Modulplan!A16=\"BU\",\"BUa\",\"BUEa\"))","v":"BUa"},{"$f":"IF(Modulplan!$H$15=\"PHa\",\"Parallel mit PH - für BU zuerst abwählen!\",IF(Modulplan!A16=\"BU\",\"BUa\",\"BUEa\"))","v":"BUa"},{"$f":"IF(Modulplan!$J$15<>\"\",\"Parallel mit PH - für BU zuerst abwählen!\",IF(Modulplan!A16=\"BU\",\"BUb\",\"BUEb\"))","v":"BUb"},{"$f":"IF(Modulplan!$L$15<>\"\",\"Parallel mit PH - für BU zuerst abwählen!\",IF(Modulplan!A16=\"BU\",\"BUb\",\"BUEb\"))","v":"BUb"}]
["Eht/Rk/Re",null,null,null,{"$f":"IF(Modulplan!$F$15=\"PHb\",\"Parallel mit PH - für BU zuerst abwählen!\",IF(Modulplan!A16=\"BU\",\"BUb\",\"BUEb\"))","v":"BUb"},{"$f":"IF(Modulplan!$H$15=\"PHb\",\"Parallel mit PH - für BU zuerst abwählen!\",IF(Modulplan!A16=\"BU\",\"BUb\",\"BUEb\"))","v":"BUb"}]
[]
[]
["Englisch",null,"Chemie"]
["E 7.Kl"]
["E 8.Kl",null,"CH",{"$f":"IF(Modulplan!B17<>\"CH\",\"CH - !aufbauend!\",\"CH\")","v":"CH - !aufbauend!"},"CH",{"$f":"IF(Modulplan!F17<>\"CH\",\"CH - !aufbauend!\",\"CH\")","v":"CH - !aufbauend!"},"CH",{"$f":"IF(Modulplan!J17<>\"CH\",\"CH - !aufbauend!\",\"CH\")","v":"CH - !aufbauend!"}]
["E durchgehend"]
["Sprache"]
["F3",null,"NAWI"]
["F5"]
["SPA",null,{"$f":"IF(OR(Modulplan!B13=\"RU\",Modulplan!B13=\"IT\"),\"Parallel mit RU/IT – für NAWI bitte zuerst abwählen!\",\"NAWI\")","v":"NAWI"},{"$f":"IF(OR(Modulplan!B13=\"RU\",Modulplan!B13=\"IT\"),\"Parallel mit RU/IT – für NAWI bitte zuerst abwählen!\",\"NAWI\")","v":"NAWI"}]
["RU"]
["IT"]
["L3",null,"INFORMATIK"]
["L5"]
[null,null,{"$f":"IF(Modulplan!A1=\"5. Klasse SKP\",\"IN-Basismodule ab 2014/15 nicht mehr wählbar\",\"IN1\")","v":"IN-Basismodule ab 2014/15 nicht mehr wählbar"},{"$f":"IF(Modulplan!A1=\"5. Klasse SKP\",\"IN-Basismodule ab 2014/15 nicht mehr wählbar\",\"IN2\")","v":"IN-Basismodule ab 2014/15 nicht mehr wählbar"},{"$f":"IF(Modulplan!A1<>\"7. Klasse SKP\", \"IN-Basismodule ab 2014/15 nicht mehr wählbar\",\"IN1\")","v":"IN-Basismodule ab 2014/15 nicht mehr wählbar"},{"$f":"IF(Modulplan!A1<>\"7. Klasse SKP\", \"IN-Basismodule ab 2014/15 nicht mehr wählbar\",\"IN2\")","v":"IN-Basismodule ab 2014/15 nicht mehr wählbar"}]
["Sprache-Std",null,null,null,{"$f":"IF(Modulplan!A1<>\"7. Klasse SKP\", \"IN-Basismodule ab 2014/15 nicht mehr wählbar\",\"IN3\")","v":"IN-Basismodule ab 2014/15 nicht mehr wählbar"},{"$f":"IF(Modulplan!A1<>\"7. Klasse SKP\", \"IN-Basismodule ab 2014/15 nicht mehr wählbar\",\"IN4\")","v":"IN-Basismodule ab 2014/15 nicht mehr wählbar"}]
[{"$f":"IF(OR(Modulplan!$A$13=\"RU\",Modulplan!$A$13=\"IT\"),\"24\",\"20\")","v":"20"}]
[{"$f":"IF(Listen!A28=\"20\",48,44)","v":48}]
[]
[]
["Klasse",null,{"$f":"IF(Modulplan!$B$26<>\"\",\"Parallel mit GS - für GW zuerst abwählen!\",IF(Modulplan!A19=\"GW\",\"GWa\",\"GWEa\"))","v":"GWa"},{"$f":"IF(Modulplan!$D$26<>\"\",\"Parallel mit GS - für GW zuerst abwählen!\",IF(Modulplan!A19=\"GW\",\"GWa\",\"GWEa\"))","v":"GWa"},{"$f":"IF(Modulplan!$F$26=\"GSa\",\"Parallel mit GS - für GW zuerst abwählen!\",IF(Modulplan!A19=\"GW\",\"GWa\",\"GWEa\"))","v":"GWa"},{"$f":"IF(Modulplan!$H$26=\"GSa\",\"Parallel mit GS - für GW zuerst abwählen!\",IF(Modulplan!A19=\"GW\",\"GWa\",\"GWEa\"))","v":"GWa"},{"$f":"IF(Modulplan!$J$26<>\"\",\"Parallel mit GS - für GW zuerst abwählen!\",IF(Modulplan!A19=\"GW\",\"GWb\",\"GWEb\"))","v":"GWb"},{"$f":"IF(Modulplan!$J$26<>\"\",\"Parallel mit GS - für GW zuerst abwählen!\",IF(Modulplan!A19=\"GW\",\"GWb\",\"GWEb\"))","v":"GWb"}]
["5C",null,null,null,{"$f":"IF(Modulplan!$F$26=\"GSb\",\"Parallel mit GS - für GW zuerst abwählen!\",IF(Modulplan!A19=\"GW\",\"GWb\",\"GWEb\"))","v":"GWb"},{"$f":"IF(Modulplan!$H$26=\"GSb\",\"Parallel mit GS - für GW zuerst abwählen!\",IF(Modulplan!A19=\"GW\",\"GWb\",\"GWEb\"))","v":"GWb"}]
["5D"]
["6C"]
["6D"]
["7C",null,"GESCHICHTE"]
["7D"]
[null,null,{"$f":"IF(OR(Modulplan!$B$19<>\"\",Modulplan!$B$25<>\"\"),\"Parallel mit GW - für GS zuerst abwählen!\",\"GSa\")","v":"GSa"},{"$f":"IF(OR(Modulplan!$D$19<>\"\",Modulplan!$D$25<>\"\"),\"Parallel mit GW - für GS zuerst abwählen!\",\"GSa\")","v":"GSa"},{"$f":"IF(OR(Modulplan!$F$19=\"GWa\",Modulplan!$F$19=\"GWEa\",Modulplan!$F$25=\"GWa\",Modulplan!$F$25=\"GWEa\"),\"Parallel mit GW - für GS zuerst abwählen!\",\"GSa\")","v":"GSa"},{"$f":"IF(OR(Modulplan!$H$19=\"GWa\",Modulplan!$H$19=\"GWEa\",Modulplan!$H$25=\"GWa\",Modulplan!$H$25=\"GWEa\"),\"Parallel mit GW - für GS zuerst abwählen!\",\"GSa\")","v":"GSa"},{"$f":"IF(OR(Modulplan!$J$19=\"GWb\",Modulplan!$J$19=\"GWEb\",Modulplan!$J$25=\"GWb\",Modulplan!$J$25=\"GWEb\"),\"Parallel mit GW - für GS zuerst abwählen!\",\"GSb\")","v":"GSb"},{"$f":"IF(OR(Modulplan!$L$19=\"GWb\",Modulplan!$L$19=\"GWEb\",Modulplan!$L$25=\"GWb\",Modulplan!$L$25=\"GWEb\"),\"Parallel mit GW - für GS zuerst abwählen!\",\"GSb\")","v":"GSb"}]
[null,null,null,null,{"$f":"IF(OR(Modulplan!$F$19=\"GWb\",Modulplan!$F$19=\"GWEb\",Modulplan!$F$25=\"GWb\",Modulplan!$F$25=\"GWEb\"),\"Parallel mit GW - für GS zuerst abwählen!\",\"GSb\")","v":"GSb"},{"$f":"IF(OR(Modulplan!$H$19=\"GWb\",Modulplan!$H$19=\"GWEb\",Modulplan!$H$25=\"GWb\",Modulplan!$H$25=\"GWEb\"),\"Parallel mit GW - für GS zuerst abwählen!\",\"GSb\")","v":"GSb"}]
["GW"]
["GWE",null,"KOSO"]
[]
["BU",null,null,null,"KOSO","KOSO","KOSO","KOSO"]
["BUE"]
[null,null,"PP"]
[null,null,null,null,{"$f":"IF(Modulplan!A1=\"5. Klasse SKP\",\"Ab 2014/15 nur in der 8. Klasse wählbar\",\"PP\")","v":"Ab 2014/15 nur in der 8. Klasse wählbar"},{"$f":"IF(Modulplan!A1=\"5. Klasse SKP\",\"Ab 2014/15 nur in der 8. Klasse wählbar\",\"PP\")","v":"Ab 2014/15 nur in der 8. Klasse wählbar"},"PP","PP"]
[]
[null,null,"BE"]
[]
[null,null,"BEa","BEa","BEa","BEa","BEb","BEb"]
[null,null,null,null,"BEb","BEb"]
[]
[]
[null,null,"ME"]
[]
[null,null,"MEa","MEa","MEa","MEa","MEb","MEb"]
[null,null,null,null,"MEb","MEb"]
[]
[null,null,"DG"]
[null,null,"DGa","DGa","DGb","DGb"]
[]
[]
[]
[null,null,"ETH/RK"]
[]
[null,null,"RK","RK","RK","RK","RK","RK"]
[null,null,"RE","RE","RE","RE","RE","RE"]
[null,null,"ETH","ETH","ETH","ETH","ETH","ETH"]